Target
Serine/threonine-protein kinase 17B
Ligand
BDBM441866
Substrate
Meas. Tech.
Activity Inhibition Assay
IC50
110±n/a nM
Citation
 Lee, KChoi, GLee, NRPark, SJJung, MEKim, SJYang, KLee, J Substituted pyrimidines for preventing or treating cancer and inflammatory diseases US Patent  US10647686 Publication Date 5/12/2020 
Target
Name:
Serine/threonine-protein kinase 17B
Synonyms:
DRAK2 STK17B Serine/threonine-protein kinase 17B (STK17B)
Type:
Enzyme
Mol. Mass.:
42332.49
Organism:
Homo sapiens (Human)
Description:
O94768
Residue:
372
  
Inhibitor
Name:
BDBM441866
Synonyms:
US10647686, Example (13)
Type:
Small organic molecule
Emp. Form.:
C19H19ClN6O4S
Mol. Mass.:
462.91
SMILES:
NCCCNc1nc(Nc2ccc(cc2)S(=O)(=O)c2ccc(cc2)[N+]([O-])=O)ncc1Cl
: