Target
Serine/threonine-protein kinase 17A
Ligand
BDBM441868
Substrate
Meas. Tech.
Activity Inhibition Assay
IC50
26.0±n/a nM
Citation
 Lee, KChoi, GLee, NRPark, SJJung, MEKim, SJYang, KLee, J Substituted pyrimidines for preventing or treating cancer and inflammatory diseases US Patent  US10647686 Publication Date 5/12/2020 
Target
Name:
Serine/threonine-protein kinase 17A
Synonyms:
DRAK1 STK17A
Type:
Enzyme Catalytic Domain
Mol. Mass.:
46544.04
Organism:
Homo sapiens (Human)
Description:
gi_109255245
Residue:
414
  
Inhibitor
Name:
BDBM441868
Synonyms:
US10647686, Example (15)
Type:
Small organic molecule
Emp. Form.:
C14H14ClF4N5
Mol. Mass.:
363.741
SMILES:
NCCCNc1nc(Nc2ccc(F)c(c2)C(F)(F)F)ncc1Cl
: