Target
Serine/threonine-protein kinase 17A
Ligand
BDBM441872
Substrate
Meas. Tech.
Activity Inhibition Assay
IC50
23.0±n/a nM
Citation
 Lee, KChoi, GLee, NRPark, SJJung, MEKim, SJYang, KLee, J Substituted pyrimidines for preventing or treating cancer and inflammatory diseases US Patent  US10647686 Publication Date 5/12/2020 
Target
Name:
Serine/threonine-protein kinase 17A
Synonyms:
DRAK1 STK17A
Type:
Enzyme Catalytic Domain
Mol. Mass.:
46544.04
Organism:
Homo sapiens (Human)
Description:
gi_109255245
Residue:
414
  
Inhibitor
Name:
BDBM441872
Synonyms:
US10647686, Example (19) | US10647686, Example 19
Type:
Small organic molecule
Emp. Form.:
C14H18ClN5
Mol. Mass.:
291.779
SMILES:
Cc1cnc(Nc2ccc(Cl)cc2)nc1NCCCN
: