Target
Serine/threonine-protein kinase 17A
Ligand
BDBM441874
Substrate
Meas. Tech.
Activity Inhibition Assay
IC50
21.0±n/a nM
Citation
 Lee, KChoi, GLee, NRPark, SJJung, MEKim, SJYang, KLee, J Substituted pyrimidines for preventing or treating cancer and inflammatory diseases US Patent  US10647686 Publication Date 5/12/2020 
Target
Name:
Serine/threonine-protein kinase 17A
Synonyms:
DRAK1 STK17A
Type:
Enzyme Catalytic Domain
Mol. Mass.:
46544.04
Organism:
Homo sapiens (Human)
Description:
gi_109255245
Residue:
414
  
Inhibitor
Name:
BDBM441874
Synonyms:
US10647686, Example (21)
Type:
Small organic molecule
Emp. Form.:
C16H20ClN5
Mol. Mass.:
317.817
SMILES:
NCCCNc1nc(Nc2ccc3CCCc3c2)ncc1Cl
: