Target
Serine/threonine-protein kinase 17A
Ligand
BDBM441887
Substrate
Meas. Tech.
Activity Inhibition Assay
IC50
160±n/a nM
Citation
 Lee, KChoi, GLee, NRPark, SJJung, MEKim, SJYang, KLee, J Substituted pyrimidines for preventing or treating cancer and inflammatory diseases US Patent  US10647686 Publication Date 5/12/2020 
Target
Name:
Serine/threonine-protein kinase 17A
Synonyms:
DRAK1 STK17A
Type:
Enzyme Catalytic Domain
Mol. Mass.:
46544.04
Organism:
Homo sapiens (Human)
Description:
gi_109255245
Residue:
414
  
Inhibitor
Name:
BDBM441887
Synonyms:
US10647686, Example (30)
Type:
Small organic molecule
Emp. Form.:
C18H25N5
Mol. Mass.:
311.4246
SMILES:
Cc1cnc(Nc2ccc3CCCCc3c2)nc1NCCCN
: