Target
Serine/threonine-protein kinase 17A
Ligand
BDBM441895
Substrate
Meas. Tech.
Activity Inhibition Assay
IC50
35.0±n/a nM
Citation
 Lee, KChoi, GLee, NRPark, SJJung, MEKim, SJYang, KLee, J Substituted pyrimidines for preventing or treating cancer and inflammatory diseases US Patent  US10647686 Publication Date 5/12/2020 
Target
Name:
Serine/threonine-protein kinase 17A
Synonyms:
DRAK1 STK17A
Type:
Enzyme Catalytic Domain
Mol. Mass.:
46544.04
Organism:
Homo sapiens (Human)
Description:
gi_109255245
Residue:
414
  
Inhibitor
Name:
BDBM441895
Synonyms:
US10647686, Example (38)
Type:
Small organic molecule
Emp. Form.:
C14H17ClFN5
Mol. Mass.:
309.77
SMILES:
Cc1cnc(Nc2ccc(F)c(Cl)c2)nc1NCCCN
: