Target
Fibroblast growth factor receptor 4
Ligand
BDBM443228
Substrate
Meas. Tech.
Inhibition Assay
IC50
3.80±n/a nM
Citation
 Chen, LGuan, DBai, HGou, JZhao, WWang, ZLing, LMa, Y Pyrimidine derivative, method for preparing same and use thereof in medicine US Patent  US10654836 Publication Date 5/19/2020 
Target
Name:
Fibroblast growth factor receptor 4
Synonyms:
CD_antigen: CD334 FGFR4 FGFR4 Fibroblast growth factor receptor JK2 TKF
Type:
Protein
Mol. Mass.:
87957.45
Organism:
Homo sapiens (Human)
Description:
P22455
Residue:
802
  
Inhibitor
Name:
BDBM443228
Synonyms:
N-(5-(4-(Cyclopropyl(methyl)amino)piperidin-1-yl)-2-((6-(3-(2,6-dichloro-3,5-dimethoxyphenyl)-1-methylureido)-4-yl)amino)phenyl) acrylamide US11001572, Example 9
Type:
Small organic molecule
Emp. Form.:
C32H38Cl2N8O4
Mol. Mass.:
669.601
SMILES:
COc1cc(OC)c(Cl)c(NC(=O)N(C)c2cc(Nc3ccc(cc3NC(=O)C=C)N3CCC(CC3)N(C)C3CC3)ncn2)c1Cl
: