Target
Prostaglandin E synthase
Ligand
BDBM451477
Substrate
Meas. Tech.
Inhibitory Activity Assay
IC50
0.110±n/a nM
Citation
 Okada, MNakano, YNose, TNishimoto, TMaeda, S Pyrimidine derivative US Patent  US10710967 Publication Date 7/14/2020 
Target
Name:
Prostaglandin E synthase
Synonyms:
MGST1L1 PGES PTGES Prostaglandin E synthase (PGES-1) Prostaglandin E synthase-1 (PGES-1) Prostaglandin E2 synthase-1 ( mPGES-1)
Type:
Protein
Mol. Mass.:
17112.22
Organism:
Homo sapiens (Human)
Description:
Residue:
152
  
Inhibitor
Name:
BDBM451477
Synonyms:
US10710967, Example 74
Type:
Small organic molecule
Emp. Form.:
C24H24ClN3O2
Mol. Mass.:
421.919
SMILES:
CC(C)C(=O)NCc1ccc(Cl)c(c1)-c1nc(cc(=O)[nH]1)-c1ccc(cc1)C1CC1
: