Target
Activin receptor type-1 [172-499]
Ligand
BDBM451799
Substrate
Meas. Tech.
Caliper Assay
IC50
20.0±n/a nM
Citation
 Arista, LBabu, SBian, JCui, KDillon, MPLattmann, RLi, JLiao, LLizos, DRamos, RStiefl, NJUllrich, TUsselmann, PWang, XWaykole, LMWeiler, SZhang, YZhou, YZhu, T Aminopyridine derivatives and their use as selective ALK-2 inhibitors US Patent  US10710980 Publication Date 7/14/2020 
Target
Name:
Activin receptor type-1 [172-499]
Synonyms:
ACVR1 ACVRLK2 Activin receptor-like kinase 2 (ALK-2)(aa 172-499) | Activin receptor-like kinase 2 (ALK2)(172-499)
Type:
Enzyme Catalytic Domain
Mol. Mass.:
37139.64
Organism:
Homo sapiens (Human)
Description:
aa 172-499
Residue:
328
  
Inhibitor
Name:
BDBM451799
Synonyms:
2-amino-N-((1r,4R)-4-hydroxycyclohexyl)-5-(4-(((R)-2-methylpyrrolidin-1-yl)methyl)phenyl)nicotinamide US10947218, Example 31
Type:
Small organic molecule
Emp. Form.:
C24H32N4O2
Mol. Mass.:
408.5365
SMILES:
C[C@@H]1CCCN1Cc1ccc(cc1)-c1cnc(N)c(c1)C(=O)N[C@H]1CC[C@H](O)CC1
: