Target
Bone morphogenetic protein receptor type-1B
Ligand
BDBM451799
Substrate
Meas. Tech.
Caliper Assay
IC50
4500±n/a nM
Citation
 Arista, LBabu, SBian, JCui, KDillon, MPLattmann, RLi, JLiao, LLizos, DRamos, RStiefl, NJUllrich, TUsselmann, PWang, XWaykole, LMWeiler, SZhang, YZhou, YZhu, T Aminopyridine derivatives and their use as selective ALK-2 inhibitors US Patent  US10710980 Publication Date 7/14/2020 
Target
Name:
Bone morphogenetic protein receptor type-1B
Synonyms:
ALK-6 BMPR1B Bone morphogenetic protein receptor type-1B (BMPR1B)
Type:
Enzyme
Mol. Mass.:
56939.41
Organism:
Homo sapiens (Human)
Description:
O00238
Residue:
502
  
Inhibitor
Name:
BDBM451799
Synonyms:
2-amino-N-((1r,4R)-4-hydroxycyclohexyl)-5-(4-(((R)-2-methylpyrrolidin-1-yl)methyl)phenyl)nicotinamide US10947218, Example 31
Type:
Small organic molecule
Emp. Form.:
C24H32N4O2
Mol. Mass.:
408.5365
SMILES:
C[C@@H]1CCCN1Cc1ccc(cc1)-c1cnc(N)c(c1)C(=O)N[C@H]1CC[C@H](O)CC1
: