Target
Solute carrier family 2, facilitated glucose transporter member 1
Ligand
BDBM453244
Substrate
Meas. Tech.
ATP Assay
IC50
55±n/a nM
Citation
 Olszewski, KPoyurovsky, MBarsotti, AKim, JLiu, KG Treatment of infectious diseases with glucose uptake inhibitors US Patent  US10729691 Publication Date 8/4/2020 
Target
Name:
Solute carrier family 2, facilitated glucose transporter member 1
Synonyms:
GLUT-1 GTR1_HUMAN Glucose transporter HepG2 glucose transporter | SLC2A1
Type:
Protein
Mol. Mass.:
54091.71
Organism:
Homo sapiens (Human)
Description:
Residue:
492
  
Inhibitor
Name:
BDBM453244
Synonyms:
2-(3-(4-((4-(1H-pyrazol-4-yl)phenyl)amino)-5,7-dihydrofuro[3,4-d]pyrimidin-2-yl)phenoxy)-N-isobutylacetamide | US10729691, Example 29
Type:
Small organic molecule
Emp. Form.:
C27H28N6O3
Mol. Mass.:
484.5496
SMILES:
CC(C)CNC(=O)COc1cccc(c1)-c1nc2COCc2c(Nc2ccc(cc2)-c2cn[nH]c2)n1
: