Target
Solute carrier family 2, facilitated glucose transporter member 1
Ligand
BDBM453271
Substrate
Meas. Tech.
ATP Assay
IC50
55±n/a nM
Citation
 Olszewski, KPoyurovsky, MBarsotti, AKim, JLiu, KG Treatment of infectious diseases with glucose uptake inhibitors US Patent  US10729691 Publication Date 8/4/2020 
Target
Name:
Solute carrier family 2, facilitated glucose transporter member 1
Synonyms:
GLUT-1 GTR1_HUMAN Glucose transporter HepG2 glucose transporter | SLC2A1
Type:
Protein
Mol. Mass.:
54091.71
Organism:
Homo sapiens (Human)
Description:
Residue:
492
  
Inhibitor
Name:
BDBM453271
Synonyms:
2-(3-(4-((4-(1H-pyrazol-4-yl)phenyl)amino)-6-acetyl-6,7-dihydro-5H-pyrrolo[3,4-d]pyrimidin-2-yl)phenoxy)-N-(tert-butyl)acetamide | US10729691, Example 56
Type:
Small organic molecule
Emp. Form.:
C29H31N7O3
Mol. Mass.:
525.6015
SMILES:
CC(=O)N1Cc2nc(nc(Nc3ccc(cc3)-c3cn[nH]c3)c2C1)-c1cccc(OCC(=O)NC(C)(C)C)c1
: