Target
Plasma kallikrein
Ligand
BDBM455035
Substrate
Meas. Tech.
Inhibitory Activity of Exemplary Compounds against Plasma Kallikrein
EC50
<1.0±n/a nM
Citation
 Papaioannou, NFink, SJMiller, TAShipps, Jr., GWTravins, JMEhmann, DERae, AEllard, JM Inhibitors of plasma kallikrein and uses thereof US Patent  US10730874 Publication Date 8/4/2020 
Target
Name:
Plasma kallikrein
Synonyms:
Fletcher factor KLKB1 Kallikrein Plasma kallikrein heavy chain Plasma prekallikrein
Type:
Protein
Mol. Mass.:
71391.16
Organism:
Homo sapiens (Human)
Description:
P03952
Residue:
638
  
Inhibitor
Name:
BDBM455035
Synonyms:
US10730874, Compound I-59 | US11352356, Compound I-59
Type:
Small organic molecule
Emp. Form.:
C23H19ClFN7O
Mol. Mass.:
463.895
SMILES:
Fc1c(ccc2nc(Cn3cc(cn3)C(=O)NCc3ncn4ccc(Cl)cc34)cn12)C1CC1
: