Target
Plasma kallikrein
Ligand
BDBM455054
Substrate
Meas. Tech.
Inhibitory Activity of Exemplary Compounds against Plasma Kallikrein
EC50
<1.0±n/a nM
Citation
 Papaioannou, NFink, SJMiller, TAShipps, Jr., GWTravins, JMEhmann, DERae, AEllard, JM Inhibitors of plasma kallikrein and uses thereof US Patent  US10730874 Publication Date 8/4/2020 
Target
Name:
Plasma kallikrein
Synonyms:
Fletcher factor KLKB1 Kallikrein Plasma kallikrein heavy chain Plasma prekallikrein
Type:
Protein
Mol. Mass.:
71391.16
Organism:
Homo sapiens (Human)
Description:
P03952
Residue:
638
  
Inhibitor
Name:
BDBM455054
Synonyms:
US10730874, Compound I-78 | US11352356, Compound I-78
Type:
Small organic molecule
Emp. Form.:
C26H24ClN7O
Mol. Mass.:
485.968
SMILES:
Clc1ccn2cnc(CNC(=O)c3cn(Cc4cn5cc(ccc5n4)C4CC4)nc3C3CC3)c2c1
: