Target
Plasma kallikrein
Ligand
BDBM455069
Substrate
Meas. Tech.
Inhibitory Activity of Exemplary Compounds against Plasma Kallikrein
EC50
<1.0±n/a nM
Citation
 Papaioannou, NFink, SJMiller, TAShipps, Jr., GWTravins, JMEhmann, DERae, AEllard, JM Inhibitors of plasma kallikrein and uses thereof US Patent  US10730874 Publication Date 8/4/2020 
Target
Name:
Plasma kallikrein
Synonyms:
Fletcher factor KLKB1 Kallikrein Plasma kallikrein heavy chain Plasma prekallikrein
Type:
Protein
Mol. Mass.:
71391.16
Organism:
Homo sapiens (Human)
Description:
P03952
Residue:
638
  
Inhibitor
Name:
BDBM455069
Synonyms:
US10730874, Compound I-93 | US11352356, Compound I-93
Type:
Small organic molecule
Emp. Form.:
C28H28ClN7O3
Mol. Mass.:
546.02
SMILES:
CCOC(=O)CCc1nn(Cc2cn3cc(ccc3n2)C2CC2)cc1C(=O)NCc1ncn2ccc(Cl)cc12
: