Target
Plasma kallikrein
Ligand
BDBM455079
Substrate
Meas. Tech.
Inhibitory Activity of Exemplary Compounds against Plasma Kallikrein
EC50
<1.0±n/a nM
Citation
 Papaioannou, NFink, SJMiller, TAShipps, Jr., GWTravins, JMEhmann, DERae, AEllard, JM Inhibitors of plasma kallikrein and uses thereof US Patent  US10730874 Publication Date 8/4/2020 
Target
Name:
Plasma kallikrein
Synonyms:
Fletcher factor KLKB1 Kallikrein Plasma kallikrein heavy chain Plasma prekallikrein
Type:
Protein
Mol. Mass.:
71391.16
Organism:
Homo sapiens (Human)
Description:
P03952
Residue:
638
  
Inhibitor
Name:
BDBM455079
Synonyms:
US10730874, Compound I-101 | US11352356, Compound I-101
Type:
Small organic molecule
Emp. Form.:
C28H29ClN8O2
Mol. Mass.:
545.035
SMILES:
Clc1ccn2cnc(CNC(=O)c3cnn(Cc4cn5cc(cc(CN6CCOCC6)c5n4)C4CC4)c3)c2c1
: