Target
Asialoglycoprotein receptor 1
Ligand
BDBM408854
Substrate
Meas. Tech.
SPR binding assay
Kd
250000±n/a nM
Citation
 Liras, SMascitti, VThuma, B Substituted-6,8-dioxabicyclo[3.2.1]octane-2,3-diol compounds as targeting agents of ASGPR US Patent  US10813942 Publication Date 10/27/2020 
Target
Name:
Asialoglycoprotein receptor 1
Synonyms:
ASGP-R 1 ASGR1 CLEC4H1 | Hepatic lectin H1
Type:
PROTEIN
Mol. Mass.:
33177.60
Organism:
Homo sapiens (Human)
Description:
ChEMBL_603824
Residue:
291
  
Inhibitor
Name:
BDBM408854
Synonyms:
US10376531, Compound II-b | US10813942, Compound II-b
Type:
Small organic molecule
Emp. Form.:
C10H19NO7
Mol. Mass.:
265.2604
SMILES:
CO[C@H]1OC(CO)(CO)[C@H](O)[C@H](O)[C@H]1NC(C)=O
: