Target
Asialoglycoprotein receptor 1
Ligand
BDBM408865
Substrate
Meas. Tech.
SPR binding assay
Kd
10200±n/a nM
Citation
 Liras, SMascitti, VThuma, B Substituted-6,8-dioxabicyclo[3.2.1]octane-2,3-diol compounds as targeting agents of ASGPR US Patent  US10813942 Publication Date 10/27/2020 
Target
Name:
Asialoglycoprotein receptor 1
Synonyms:
ASGP-R 1 ASGR1 CLEC4H1 | Hepatic lectin H1
Type:
PROTEIN
Mol. Mass.:
33177.60
Organism:
Homo sapiens (Human)
Description:
ChEMBL_603824
Residue:
291
  
Inhibitor
Name:
BDBM408865
Synonyms:
US10376531, Compound 29 | US10813942, Compound 29
Type:
Small organic molecule
Emp. Form.:
C10H17NO6
Mol. Mass.:
247.2451
SMILES:
CN([C@H]1[C@H]2OC[C@](CO)(O2)[C@H](O)[C@@H]1O)C(C)=O
: