Target
Asialoglycoprotein receptor 1
Ligand
BDBM408868
Substrate
Meas. Tech.
SPR binding assay
Kd
2000±n/a nM
Citation
 Liras, SMascitti, VThuma, B Substituted-6,8-dioxabicyclo[3.2.1]octane-2,3-diol compounds as targeting agents of ASGPR US Patent  US10813942 Publication Date 10/27/2020 
Target
Name:
Asialoglycoprotein receptor 1
Synonyms:
ASGP-R 1 ASGR1 CLEC4H1 | Hepatic lectin H1
Type:
PROTEIN
Mol. Mass.:
33177.60
Organism:
Homo sapiens (Human)
Description:
ChEMBL_603824
Residue:
291
  
Inhibitor
Name:
BDBM408868
Synonyms:
US10376531, Compound 28 | US10813942, Compound 28
Type:
Small organic molecule
Emp. Form.:
C10H14F3NO6
Mol. Mass.:
301.2165
SMILES:
OC[C@@]12CO[C@@H](O1)[C@H](NC(=O)CC(F)(F)F)[C@@H](O)[C@H]2O
: