Target
Nuclear receptor ROR-gamma
Ligand
BDBM472171
Substrate
Meas. Tech.
Binding Assay
Ki
<100±n/a nM
Citation
 Claremon, DADillard, LWFan, YLotesta, SDSingh, SBTice, CMZhao, WZhuang, L Benzimidazole derivatives as modulators of ROR-gamma US Patent  US10829481 Publication Date 11/10/2020 
Target
Name:
Nuclear receptor ROR-gamma
Synonyms:
NR1F3 Nuclear receptor ROR-gamma (RORC) RAR-related orphan receptor C (RORc) RORG RZRG Retinoid-related orphan receptor-gamma (RORc)
Type:
Enzyme Catalytic Domain
Mol. Mass.:
58218.40
Organism:
Homo sapiens (Human)
Description:
P51449
Residue:
518
  
Inhibitor
Name:
BDBM472171
Synonyms:
(R)-1-((2,2-difluorobenzo[d][1,3]dioxol-4-yl)methyl)-2-(1,1- | US10829481, Compound I-14
Type:
Small organic molecule
Emp. Form.:
C28H25F4N3O6S
Mol. Mass.:
607.573
SMILES:
CCS(=O)(=O)c1ccc(cc1)[C@H](CO)NC(=O)c1ccc2n(Cc3cccc4OC(F)(F)Oc34)c(nc2c1)C(C)(F)F
: