Target
Nuclear receptor ROR-gamma
Ligand
BDBM472175
Substrate
Meas. Tech.
Binding Assay
Ki
<100±n/a nM
Citation
 Claremon, DADillard, LWFan, YLotesta, SDSingh, SBTice, CMZhao, WZhuang, L Benzimidazole derivatives as modulators of ROR-gamma US Patent  US10829481 Publication Date 11/10/2020 
Target
Name:
Nuclear receptor ROR-gamma
Synonyms:
NR1F3 Nuclear receptor ROR-gamma (RORC) RAR-related orphan receptor C (RORc) RORG RZRG Retinoid-related orphan receptor-gamma (RORc)
Type:
Enzyme Catalytic Domain
Mol. Mass.:
58218.40
Organism:
Homo sapiens (Human)
Description:
P51449
Residue:
518
  
Inhibitor
Name:
BDBM472175
Synonyms:
(R)-1-((2,2-difluorobenzo[d][1,3]dioxol-4-yl)methyl)-2-ethyl-N-(1-(4- | US10829481, Compound I-16
Type:
Small organic molecule
Emp. Form.:
C28H27F2N3O6S
Mol. Mass.:
571.592
SMILES:
CCc1nc2cc(ccc2n1Cc1cccc2OC(F)(F)Oc12)C(=O)N[C@@H](CO)c1ccc(cc1)S(=O)(=O)CC
: