Target
Nuclear receptor ROR-gamma
Ligand
BDBM472386
Substrate
Meas. Tech.
Binding Assay
Ki
<100±n/a nM
Citation
 Claremon, DADillard, LWFan, YLotesta, SDSingh, SBTice, CMZhao, WZhuang, L Benzimidazole derivatives as modulators of ROR-gamma US Patent  US10829481 Publication Date 11/10/2020 
Target
Name:
Nuclear receptor ROR-gamma
Synonyms:
NR1F3 Nuclear receptor ROR-gamma (RORC) RAR-related orphan receptor C (RORc) RORG RZRG Retinoid-related orphan receptor-gamma (RORc)
Type:
Enzyme Catalytic Domain
Mol. Mass.:
58218.40
Organism:
Homo sapiens (Human)
Description:
P51449
Residue:
518
  
Inhibitor
Name:
BDBM472386
Synonyms:
N-(1-((2,2-difluorobenzo[d][1,3]dioxol-4-yl)methyl)-2- | US10829481, Compound I-170.2
Type:
Small organic molecule
Emp. Form.:
C26H20F5N3O6S
Mol. Mass.:
597.511
SMILES:
CCS(=O)(=O)c1ccc(cc1)[C@@H](O)C(=O)Nc1ccc2n(Cc3cccc4OC(F)(F)Oc34)c(nc2c1)C(F)(F)F
: