Target
Phosphatidylinositol 4,5-bisphosphate 3-kinase catalytic subunit delta isoform
Ligand
BDBM295665
Substrate
Meas. Tech.
Biochemical Inhibition Assay
Ki
18.2±n/a nM
Citation
 Braun, MHanan, EStaben, STHeald, RAMacleod, CElliott, R Benzoxazepin oxazolidinone compounds and methods of use US Patent  US10851091 Publication Date 12/1/2020 
Target
Name:
Phosphatidylinositol 4,5-bisphosphate 3-kinase catalytic subunit delta isoform
Synonyms:
PI3-kinase p110 subunit delta PI3-kinase subunit p110-delta PIK3CD Phosphatidylinositol 4,5-biphosphate 3-kinase catalytic subunit delta (PIK3CD) Phosphatidylinositol 4,5-bisphosphate 3-kinase 110 kDa catalytic subunit delta (PI3K delta) Phosphatidylinositol 4,5-bisphosphate 3-kinase catalytic subunit delta (PI3Kdelta) Phosphatidylinositol 4,5-bisphosphate 3-kinase catalytic subunit delta isoform (PI3K delta) Phosphatidylinositol 4,5-bisphosphate 3-kinase catalytic subunit delta isoform (PI3K-delta) Phosphatidylinositol 4,5-bisphosphate 3-kinase catalytic subunit delta isoform (PI3Kdelta)
Type:
Enzyme Subunit
Mol. Mass.:
119489.41
Organism:
Homo sapiens (Human)
Description:
O00329
Residue:
1044
  
Inhibitor
Name:
BDBM295665
Synonyms:
(S)-2-((2-((S)-4-(difluoromethyl)- 2-oxooxazolidin-3-yl)-5,6- dihydrobenzo[f]imidazo[1,2- d][1,4]oxazepin-9- yl)amino)propanamide US10851091, Compound 101
Type:
Small organic molecule
Emp. Form.:
C18H19F2N5O4
Mol. Mass.:
407.3714
SMILES:
C[C@H](Nc1ccc2-c3nc(cn3CCOc2c1)N1[C@@H](COC1=O)C(F)F)C(N)=O
: