Target
Phosphatidylinositol 4,5-bisphosphate 3-kinase catalytic subunit gamma isoform
Ligand
BDBM295675
Substrate
Meas. Tech.
Biochemical Inhibition Assay
Ki
0.390±n/a nM
Citation
 Braun, MHanan, EStaben, STHeald, RAMacleod, CElliott, R Benzoxazepin oxazolidinone compounds and methods of use US Patent  US10851091 Publication Date 12/1/2020 
Target
Name:
Phosphatidylinositol 4,5-bisphosphate 3-kinase catalytic subunit gamma isoform
Synonyms:
PI3-kinase p110 subunit gamma PI3Kgamma PK3CG_HUMAN Phosphatidylinositol 4,5-bisphosphate 3-kinase (PI3K) Phosphatidylinositol 4,5-bisphosphate 3-kinase catalytic subunit gamma (PI3Kgamma) Phosphatidylinositol 4,5-bisphosphate 3-kinase catalytic subunit gamma isoform (PI3K) Phosphatidylinositol-4,5-bisphosphate 3-kinase catalytic subunit gamma isoform Phosphoinositide 3-kinases gamma (PI3K gamma) p120-PI3K
Type:
Enzyme Subunit
Mol. Mass.:
126470.30
Organism:
Homo sapiens (Human)
Description:
P48736
Residue:
1102
  
Inhibitor
Name:
BDBM295675
Synonyms:
US10851091, U.S. Pat. No. 8,242,104 No. 469 | US8242104, Compound 469
Type:
Small organic molecule
Emp. Form.:
C20H20F3N7O2
Mol. Mass.:
447.4137
SMILES:
NC(=O)[C@@H]1CCCN1c1ccc2-c3nc(cn3CCOc2c1)-c1ncnn1CC(F)(F)F
: