Target
Phosphatidylinositol 4,5-bisphosphate 3-kinase catalytic subunit gamma isoform
Ligand
BDBM475621
Substrate
Meas. Tech.
Biochemical Inhibition Assay
Ki
9.41±n/a nM
Citation
 Braun, MHanan, EStaben, STHeald, RAMacleod, CElliott, R Benzoxazepin oxazolidinone compounds and methods of use US Patent  US10851091 Publication Date 12/1/2020 
Target
Name:
Phosphatidylinositol 4,5-bisphosphate 3-kinase catalytic subunit gamma isoform
Synonyms:
PI3-kinase p110 subunit gamma PI3Kgamma PK3CG_HUMAN Phosphatidylinositol 4,5-bisphosphate 3-kinase (PI3K) Phosphatidylinositol 4,5-bisphosphate 3-kinase catalytic subunit gamma (PI3Kgamma) Phosphatidylinositol 4,5-bisphosphate 3-kinase catalytic subunit gamma isoform (PI3K) Phosphatidylinositol-4,5-bisphosphate 3-kinase catalytic subunit gamma isoform Phosphoinositide 3-kinases gamma (PI3K gamma) p120-PI3K
Type:
Enzyme Subunit
Mol. Mass.:
126470.30
Organism:
Homo sapiens (Human)
Description:
P48736
Residue:
1102
  
Inhibitor
Name:
BDBM475621
Synonyms:
US10851091, U.S. Pat. No. 8,242,104 No. 549 isomer 1
Type:
Small organic molecule
Emp. Form.:
C21H24N6O3
Mol. Mass.:
408.4537
SMILES:
CC(C)n1ncnc1-c1cn2CCOc3cc(O[C@H](C4CC4)C(N)=O)ccc3-c2n1
: