Target
Activin receptor type-1 [172-499]
Ligand
BDBM451803
Substrate
Meas. Tech.
ADPGlo Assay
IC50
17.0±n/a nM
Citation
 Arista, LBabu, SBian, JCui, KDillon, MPLattmann, RLi, JLiao, LLizos, DRamos, RStiefl, NJUllrich, TUsselmann, PWang, XWaykole, LMWeiler, SZhang, YZhou, YZhu, T Aminopyridine derivatives and their use as selective ALK-2 inhibitors US Patent  US10947218 Publication Date 3/16/2021 
Target
Name:
Activin receptor type-1 [172-499]
Synonyms:
ACVR1 ACVRLK2 Activin receptor-like kinase 2 (ALK-2)(aa 172-499) | Activin receptor-like kinase 2 (ALK2)(172-499)
Type:
Enzyme Catalytic Domain
Mol. Mass.:
37139.64
Organism:
Homo sapiens (Human)
Description:
aa 172-499
Residue:
328
  
Inhibitor
Name:
BDBM451803
Synonyms:
US10710980, Example 35 | US10947218, Example 35
Type:
Small organic molecule
Emp. Form.:
C31H38F2N4O2
Mol. Mass.:
536.6558
SMILES:
Nc1ncc(cc1C(=O)NC12CCC(O)(CC1)CC2)-c1ccc(cc1)[C@]12C[C@H]1CN(C2)C1CCC(F)(F)CC1
: