Target
Bone morphogenetic protein receptor type-1B
Ligand
BDBM451803
Substrate
Meas. Tech.
Caliper Assay
IC50
4500±n/a nM
Citation
 Arista, LBabu, SBian, JCui, KDillon, MPLattmann, RLi, JLiao, LLizos, DRamos, RStiefl, NJUllrich, TUsselmann, PWang, XWaykole, LMWeiler, SZhang, YZhou, YZhu, T Aminopyridine derivatives and their use as selective ALK-2 inhibitors US Patent  US10947218 Publication Date 3/16/2021 
Target
Name:
Bone morphogenetic protein receptor type-1B
Synonyms:
ALK-6 BMPR1B Bone morphogenetic protein receptor type-1B (BMPR1B)
Type:
Enzyme
Mol. Mass.:
56939.41
Organism:
Homo sapiens (Human)
Description:
O00238
Residue:
502
  
Inhibitor
Name:
BDBM451803
Synonyms:
US10710980, Example 35 | US10947218, Example 35
Type:
Small organic molecule
Emp. Form.:
C31H38F2N4O2
Mol. Mass.:
536.6558
SMILES:
Nc1ncc(cc1C(=O)NC12CCC(O)(CC1)CC2)-c1ccc(cc1)[C@]12C[C@H]1CN(C2)C1CCC(F)(F)CC1
: