Target
Serine/threonine-protein kinase ATR
Ligand
BDBM420448
Substrate
Meas. Tech.
Inhibition Assay
Ki
<10±n/a nM
Citation
 Charrier, JDurrant, SKay, DKnegtel, RMacCormick, SMortimore, MO''Donnell, MPinder, JRutherford, AVirani, ANYoung, SReaper, PM Substituted pyrazines as ATR kinase inhibitors US Patent  US10961232 Publication Date 3/30/2021 
Target
Name:
Serine/threonine-protein kinase ATR
Synonyms:
ATR Ataxia telangiectasia and Rad3-related protein (ATR) FRP1 | Serine-protein kinase ATR
Type:
Protein
Mol. Mass.:
301404.58
Organism:
Homo sapiens (Human)
Description:
Q13535
Residue:
2644
  
Inhibitor
Name:
BDBM420448
Synonyms:
US10479784, Compound I-118 | US10961232, Compound I-118
Type:
Small organic molecule
Emp. Form.:
C19H14F3N5O2S
Mol. Mass.:
433.407
SMILES:
CS(=O)(=O)c1ccc(cc1)-c1cnc(N)c(n1)-c1nc2ccc(cc2[nH]1)C(F)(F)F
: