Target
Serine/threonine-protein kinase ATR
Ligand
BDBM420624
Substrate
Meas. Tech.
Inhibition Assay
Ki
<10±n/a nM
Citation
 Charrier, JDurrant, SKay, DKnegtel, RMacCormick, SMortimore, MO''Donnell, MPinder, JRutherford, AVirani, ANYoung, SReaper, PM Substituted pyrazines as ATR kinase inhibitors US Patent  US10961232 Publication Date 3/30/2021 
Target
Name:
Serine/threonine-protein kinase ATR
Synonyms:
ATR Ataxia telangiectasia and Rad3-related protein (ATR) FRP1 | Serine-protein kinase ATR
Type:
Protein
Mol. Mass.:
301404.58
Organism:
Homo sapiens (Human)
Description:
Q13535
Residue:
2644
  
Inhibitor
Name:
BDBM420624
Synonyms:
5-[3-amino-6-(4-isopropylsulfonylphenyl)pyrazin-2-yl]-1,3,4-oxadiazole-2-carboxylic acid US10961232, Compound IA-128
Type:
Small organic molecule
Emp. Form.:
C16H15N5O5S
Mol. Mass.:
389.386
SMILES:
CC(C)S(=O)(=O)c1ccc(cc1)-c1cnc(N)c(n1)-c1nnc(o1)C(O)=O
: