Target
Serine/threonine-protein kinase ATR
Ligand
BDBM420645
Substrate
Meas. Tech.
Inhibition Assay
Ki
<10±n/a nM
Citation
 Charrier, JDurrant, SKay, DKnegtel, RMacCormick, SMortimore, MO''Donnell, MPinder, JRutherford, AVirani, ANYoung, SReaper, PM Substituted pyrazines as ATR kinase inhibitors US Patent  US10961232 Publication Date 3/30/2021 
Target
Name:
Serine/threonine-protein kinase ATR
Synonyms:
ATR Ataxia telangiectasia and Rad3-related protein (ATR) FRP1 | Serine-protein kinase ATR
Type:
Protein
Mol. Mass.:
301404.58
Organism:
Homo sapiens (Human)
Description:
Q13535
Residue:
2644
  
Inhibitor
Name:
BDBM420645
Synonyms:
US10479784, Compound IA-149 | US10961232, Compound IA-149
Type:
Small organic molecule
Emp. Form.:
C20H17N5O3S
Mol. Mass.:
407.446
SMILES:
CCS(=O)(=O)c1ccc(cc1)-c1cnc(N)c(n1)-c1nnc(o1)-c1ccccc1
: