Target
Serine/threonine-protein kinase ATR
Ligand
BDBM420668
Substrate
Meas. Tech.
Inhibition Assay
Ki
<10±n/a nM
Citation
 Charrier, JDurrant, SKay, DKnegtel, RMacCormick, SMortimore, MO''Donnell, MPinder, JRutherford, AVirani, ANYoung, SReaper, PM Substituted pyrazines as ATR kinase inhibitors US Patent  US10961232 Publication Date 3/30/2021 
Target
Name:
Serine/threonine-protein kinase ATR
Synonyms:
ATR Ataxia telangiectasia and Rad3-related protein (ATR) FRP1 | Serine-protein kinase ATR
Type:
Protein
Mol. Mass.:
301404.58
Organism:
Homo sapiens (Human)
Description:
Q13535
Residue:
2644
  
Inhibitor
Name:
BDBM420668
Synonyms:
4-(5-amino-6-(5-(3-methoxythiophen-2-yl)-1,3,4-oxadiazol-2-yl)pyrazin-2-yl)-N,N-dimethylbenzamide US10961232, Compound IA-172
Type:
Small organic molecule
Emp. Form.:
C20H18N6O3S
Mol. Mass.:
422.46
SMILES:
COc1ccsc1-c1nnc(o1)-c1nc(cnc1N)-c1ccc(cc1)C(=O)N(C)C
: