Target
Serine/threonine-protein kinase ATR
Ligand
BDBM420949
Substrate
Meas. Tech.
Inhibition Assay
Ki
<10±n/a nM
Citation
 Charrier, JDurrant, SKay, DKnegtel, RMacCormick, SMortimore, MO''Donnell, MPinder, JRutherford, AVirani, ANYoung, SReaper, PM Substituted pyrazines as ATR kinase inhibitors US Patent  US10961232 Publication Date 3/30/2021 
Target
Name:
Serine/threonine-protein kinase ATR
Synonyms:
ATR Ataxia telangiectasia and Rad3-related protein (ATR) FRP1 | Serine-protein kinase ATR
Type:
Protein
Mol. Mass.:
301404.58
Organism:
Homo sapiens (Human)
Description:
Q13535
Residue:
2644
  
Inhibitor
Name:
BDBM420949
Synonyms:
US10479784, Compound VII-9 | US10961232, Compound VII-9
Type:
Small organic molecule
Emp. Form.:
C18H17N5O4S
Mol. Mass.:
399.424
SMILES:
COc1ccncc1NC(=O)c1nc(cnc1N)-c1ccc(cc1)S(C)(=O)=O
: