Target
Receptor-type tyrosine-protein kinase FLT3
Ligand
BDBM301795
Substrate
Meas. Tech.
FLT3 Kinase Assay
IC50
<50.0±n/a nM
Citation
 Lombardi Borgia, ACiomei, MDonati, DNesi, M Substituted indazole derivatives active as kinase inhibitiors US Patent  US9597317 Publication Date 3/21/2017 
Target
Name:
Receptor-type tyrosine-protein kinase FLT3
Synonyms:
CD135 FL cytokine receptor FLK2 FLT3 Fetal liver kinase-2 Fms-like tyrosine kinase 3 (Flt-3) STK-1 Stem cell tyrosine kinase 1
Type:
Enzyme
Mol. Mass.:
112888.62
Organism:
Homo sapiens (Human)
Description:
P36888
Residue:
993
  
Inhibitor
Name:
BDBM301795
Synonyms:
N-[6-(2-Benzyloxy-ethoxy)-1H-indazol-3-yl]-4-methyl-(1-methylpiperidin-4-yl)-amino-benzamide | US9597317, 23
Type:
Small organic molecule
Emp. Form.:
C30H35N5O3
Mol. Mass.:
513.6306
SMILES:
CN1CCC(CC1)c1c(C)ccc(C(=O)Nc2n[nH]c3cc(OCCOCc4ccccc4)ccc23)c1N
: