Target
Plasma kallikrein
Ligand
BDBM492872
Substrate
Meas. Tech.
In Vitro Enzyme Inhibition
IC50
5500±n/a nM
Citation
 McDonald, AQian, S Therapeutic inhibitory compounds US Patent  US10981893 Publication Date 4/20/2021 
Target
Name:
Plasma kallikrein
Synonyms:
Fletcher factor KLKB1 Kallikrein Plasma kallikrein heavy chain Plasma prekallikrein
Type:
Protein
Mol. Mass.:
71391.16
Organism:
Homo sapiens (Human)
Description:
P03952
Residue:
638
  
Inhibitor
Name:
BDBM492872
Synonyms:
N-((5-chloro-1H- indazol-3-yl)methyl)-5- (2- (trifluoromethyl)benzyl) nicotinamide | US10981893, Example 1
Type:
Small organic molecule
Emp. Form.:
C22H16ClF3N4O
Mol. Mass.:
444.837
SMILES:
FC(F)(F)c1ccccc1Cc1cncc(c1)C(=O)NCc1n[nH]c2ccc(Cl)cc12
: