Target
Plasma kallikrein
Ligand
BDBM492876
Substrate
Meas. Tech.
In Vitro Enzyme Inhibition
IC50
5500±n/a nM
Citation
 McDonald, AQian, S Therapeutic inhibitory compounds US Patent  US10981893 Publication Date 4/20/2021 
Target
Name:
Plasma kallikrein
Synonyms:
Fletcher factor KLKB1 Kallikrein Plasma kallikrein heavy chain Plasma prekallikrein
Type:
Protein
Mol. Mass.:
71391.16
Organism:
Homo sapiens (Human)
Description:
P03952
Residue:
638
  
Inhibitor
Name:
BDBM492876
Synonyms:
5-benzyl-N-((5-chloro- 1H-indazol-3- yl)methyl)nicotinamide | US10981893, Example 5
Type:
Small organic molecule
Emp. Form.:
C21H17ClN4O
Mol. Mass.:
376.839
SMILES:
Clc1ccc2[nH]nc(CNC(=O)c3cncc(Cc4ccccc4)c3)c2c1
: