Target
Plasma kallikrein
Ligand
BDBM492878
Substrate
Meas. Tech.
In Vitro Enzyme Inhibition
IC50
5500±n/a nM
Citation
 McDonald, AQian, S Therapeutic inhibitory compounds US Patent  US10981893 Publication Date 4/20/2021 
Target
Name:
Plasma kallikrein
Synonyms:
Fletcher factor KLKB1 Kallikrein Plasma kallikrein heavy chain Plasma prekallikrein
Type:
Protein
Mol. Mass.:
71391.16
Organism:
Homo sapiens (Human)
Description:
P03952
Residue:
638
  
Inhibitor
Name:
BDBM492878
Synonyms:
N-((3-chloro-6-fluoro- 1H-indol-5-yl)methyl)- 5-((4-cyano-1H- pyrazol-1- yl)methyl)nicotinamide | US10981893, Example 7
Type:
Small organic molecule
Emp. Form.:
C20H14ClFN6O
Mol. Mass.:
408.816
SMILES:
Fc1cc2[nH]cc(Cl)c2cc1CNC(=O)c1cncc(Cn2cc(cn2)C#N)c1
: