Target
Plasma kallikrein
Ligand
BDBM492879
Substrate
Meas. Tech.
In Vitro Enzyme Inhibition
IC50
10000±n/a nM
Citation
 McDonald, AQian, S Therapeutic inhibitory compounds US Patent  US10981893 Publication Date 4/20/2021 
Target
Name:
Plasma kallikrein
Synonyms:
Fletcher factor KLKB1 Kallikrein Plasma kallikrein heavy chain Plasma prekallikrein
Type:
Protein
Mol. Mass.:
71391.16
Organism:
Homo sapiens (Human)
Description:
P03952
Residue:
638
  
Inhibitor
Name:
BDBM492879
Synonyms:
5-((4-carbamoyl-1H- pyrazol-1-yl)methyl)-N- ((3-chloro-6-fluoro-1H- indol-5- yl)methyl)nicotinamide | US10981893, Example 8
Type:
Small organic molecule
Emp. Form.:
C20H16ClFN6O2
Mol. Mass.:
426.831
SMILES:
NC(=O)c1cnn(Cc2cncc(c2)C(=O)NCc2cc3c(Cl)c[nH]c3cc2F)c1
: