Target
Plasma kallikrein
Ligand
BDBM492881
Substrate
Meas. Tech.
In Vitro Enzyme Inhibition
IC50
10000±n/a nM
Citation
 McDonald, AQian, S Therapeutic inhibitory compounds US Patent  US10981893 Publication Date 4/20/2021 
Target
Name:
Plasma kallikrein
Synonyms:
Fletcher factor KLKB1 Kallikrein Plasma kallikrein heavy chain Plasma prekallikrein
Type:
Protein
Mol. Mass.:
71391.16
Organism:
Homo sapiens (Human)
Description:
P03952
Residue:
638
  
Inhibitor
Name:
BDBM492881
Synonyms:
N-((5-chloro-1H- indazol-3-yl)methyl)-6- (methyl(4-((2- oxopyridin-1(2H)- yl)methyl)phenyl)amino) picolinamide | US10981893, Example 10
Type:
Small organic molecule
Emp. Form.:
C27H23ClN6O2
Mol. Mass.:
498.964
SMILES:
CN(c1ccc(Cn2ccccc2=O)cc1)c1cncc(c1)C(=O)NCc1n[nH]c2ccc(Cl)cc12
: