Target
Plasma kallikrein
Ligand
BDBM492884
Substrate
Meas. Tech.
In Vitro Enzyme Inhibition
IC50
5500±n/a nM
Citation
 McDonald, AQian, S Therapeutic inhibitory compounds US Patent  US10981893 Publication Date 4/20/2021 
Target
Name:
Plasma kallikrein
Synonyms:
Fletcher factor KLKB1 Kallikrein Plasma kallikrein heavy chain Plasma prekallikrein
Type:
Protein
Mol. Mass.:
71391.16
Organism:
Homo sapiens (Human)
Description:
P03952
Residue:
638
  
Inhibitor
Name:
BDBM492884
Synonyms:
N-((5-chloro-1H- indazol-3-yl)methyl)-3- (1-(4-((2-oxopyridin- 1(2H)- yl)methyl)phenyl)vinyl) benzamide | US10981893, Example 13
Type:
Small organic molecule
Emp. Form.:
C28H22ClN5O2
Mol. Mass.:
495.96
SMILES:
Clc1ccc2[nH]nc(CNC(=O)c3cncc(c3)C(=C)c3ccc(Cn4ccccc4=O)cc3)c2c1
: