Target
Plasma kallikrein
Ligand
BDBM492885
Substrate
Meas. Tech.
In Vitro Enzyme Inhibition
IC50
5500±n/a nM
Citation
 McDonald, AQian, S Therapeutic inhibitory compounds US Patent  US10981893 Publication Date 4/20/2021 
Target
Name:
Plasma kallikrein
Synonyms:
Fletcher factor KLKB1 Kallikrein Plasma kallikrein heavy chain Plasma prekallikrein
Type:
Protein
Mol. Mass.:
71391.16
Organism:
Homo sapiens (Human)
Description:
P03952
Residue:
638
  
Inhibitor
Name:
BDBM492885
Synonyms:
N-(4-carbamoylbenzyl)- 5-(4-((2-oxopyridin- 1(2H)- yl)methyl)benzyl) nicotinamide | US10981893, Example 14
Type:
Small organic molecule
Emp. Form.:
C27H24N4O3
Mol. Mass.:
452.5045
SMILES:
NC(=O)c1ccc(CNC(=O)c2cncc(Cc3ccc(Cn4ccccc4=O)cc3)c2)cc1
: