Target
Plasma kallikrein
Ligand
BDBM492886
Substrate
Meas. Tech.
In Vitro Enzyme Inhibition
IC50
5500±n/a nM
Citation
 McDonald, AQian, S Therapeutic inhibitory compounds US Patent  US10981893 Publication Date 4/20/2021 
Target
Name:
Plasma kallikrein
Synonyms:
Fletcher factor KLKB1 Kallikrein Plasma kallikrein heavy chain Plasma prekallikrein
Type:
Protein
Mol. Mass.:
71391.16
Organism:
Homo sapiens (Human)
Description:
P03952
Residue:
638
  
Inhibitor
Name:
BDBM492886
Synonyms:
N-(4-chlorobenzyl)-5- (4-((2-oxopyridin- 1(2H)- yl)methyl)benzyl) nicotinamide | US10981893, Example 15
Type:
Small organic molecule
Emp. Form.:
C26H22ClN3O2
Mol. Mass.:
443.925
SMILES:
Clc1ccc(CNC(=O)c2cncc(Cc3ccc(Cn4ccccc4=O)cc3)c2)cc1
: