Target
Plasma kallikrein
Ligand
BDBM492889
Substrate
Meas. Tech.
In Vitro Enzyme Inhibition
IC50
10000±n/a nM
Citation
 McDonald, AQian, S Therapeutic inhibitory compounds US Patent  US10981893 Publication Date 4/20/2021 
Target
Name:
Plasma kallikrein
Synonyms:
Fletcher factor KLKB1 Kallikrein Plasma kallikrein heavy chain Plasma prekallikrein
Type:
Protein
Mol. Mass.:
71391.16
Organism:
Homo sapiens (Human)
Description:
P03952
Residue:
638
  
Inhibitor
Name:
BDBM492889
Synonyms:
N-(4-bromo-3- fluorobenzyl)-2-(4-((2- oxopyridin-1(2H)- yl)methyl)benzyl) isonicotinamide | US10981893, Example 18
Type:
Small organic molecule
Emp. Form.:
C26H21BrFN3O2
Mol. Mass.:
506.366
SMILES:
Fc1cc(CNC(=O)c2ccnc(Cc3ccc(Cn4ccccc4=O)cc3)c2)ccc1Br
: