Target
Plasma kallikrein
Ligand
BDBM492891
Substrate
Meas. Tech.
In Vitro Enzyme Inhibition
IC50
550±n/a nM
Citation
 McDonald, AQian, S Therapeutic inhibitory compounds US Patent  US10981893 Publication Date 4/20/2021 
Target
Name:
Plasma kallikrein
Synonyms:
Fletcher factor KLKB1 Kallikrein Plasma kallikrein heavy chain Plasma prekallikrein
Type:
Protein
Mol. Mass.:
71391.16
Organism:
Homo sapiens (Human)
Description:
P03952
Residue:
638
  
Inhibitor
Name:
BDBM492891
Synonyms:
N-((3- aminobenzo[d]isoxazol- 6-yl)methyl)-2-(3- (methylsulfonyl)-4-((2- oxopyridin-1(2H)- yl)methyl)benzyl) isonicotinamide | US10981893, Example 20
Type:
Small organic molecule
Emp. Form.:
C28H25N5O3
Mol. Mass.:
479.5298
SMILES:
Cc1cc(Cc2cc(ccn2)C(=O)NCc2ccc3c(N)noc3c2)ccc1Cn1ccccc1=O
: