Target
Plasma kallikrein
Ligand
BDBM492892
Substrate
Meas. Tech.
In Vitro Enzyme Inhibition
IC50
<100±n/a nM
Citation
 McDonald, AQian, S Therapeutic inhibitory compounds US Patent  US10981893 Publication Date 4/20/2021 
Target
Name:
Plasma kallikrein
Synonyms:
Fletcher factor KLKB1 Kallikrein Plasma kallikrein heavy chain Plasma prekallikrein
Type:
Protein
Mol. Mass.:
71391.16
Organism:
Homo sapiens (Human)
Description:
P03952
Residue:
638
  
Inhibitor
Name:
BDBM492892
Synonyms:
N-((6-amino-2,4- dimethylpyridin-3- yl)methyl)-1-((3- chloroquinolin-6- yl)methyl)-6-oxo-1,6- dihydropyridine-3- carboxamide | US10981893, Example 21
Type:
Small organic molecule
Emp. Form.:
C24H22ClN5O2
Mol. Mass.:
447.917
SMILES:
Cc1cc(N)nc(C)c1CNC(=O)c1ccc(=O)n(Cc2ccc3ncc(Cl)cc3c2)c1
: