Target
Plasma kallikrein
Ligand
BDBM492896
Substrate
Meas. Tech.
In Vitro Enzyme Inhibition
IC50
<100±n/a nM
Citation
 McDonald, AQian, S Therapeutic inhibitory compounds US Patent  US10981893 Publication Date 4/20/2021 
Target
Name:
Plasma kallikrein
Synonyms:
Fletcher factor KLKB1 Kallikrein Plasma kallikrein heavy chain Plasma prekallikrein
Type:
Protein
Mol. Mass.:
71391.16
Organism:
Homo sapiens (Human)
Description:
P03952
Residue:
638
  
Inhibitor
Name:
BDBM492896
Synonyms:
N-((6-amino-2,4- dimethylpyridin-3- yl)methyl)-6-((3- chloroquinolin-6- yl)methyl)pyrazine-2- carboxamide | US10981893, Example 25
Type:
Small organic molecule
Emp. Form.:
C23H21ClN6O
Mol. Mass.:
432.905
SMILES:
Cc1cc(N)nc(C)c1CNC(=O)c1cncc(Cc2ccc3ncc(Cl)cc3c2)n1
: