Target
Plasma kallikrein
Ligand
BDBM492898
Substrate
Meas. Tech.
In Vitro Enzyme Inhibition
IC50
550±n/a nM
Citation
 McDonald, AQian, S Therapeutic inhibitory compounds US Patent  US10981893 Publication Date 4/20/2021 
Target
Name:
Plasma kallikrein
Synonyms:
Fletcher factor KLKB1 Kallikrein Plasma kallikrein heavy chain Plasma prekallikrein
Type:
Protein
Mol. Mass.:
71391.16
Organism:
Homo sapiens (Human)
Description:
P03952
Residue:
638
  
Inhibitor
Name:
BDBM492898
Synonyms:
N-((6-amino-4- (trifluoromethyl)pyridin- 3-yl)methyl)-2-(3- (methylsulfonyl)-4-((2- oxopyridin-1(2H)- yl)methyl)benzyl) isonicotinamide | US10981893, Example 27
Type:
Small organic molecule
Emp. Form.:
C27H24F3N5O4S
Mol. Mass.:
571.571
SMILES:
CS(=O)(=O)c1cc(Cc2cc(ccn2)C(=O)NCc2cnc(N)cc2C(F)(F)F)ccc1Cn1ccccc1=O
: