Target
Plasma kallikrein
Ligand
BDBM492899
Substrate
Meas. Tech.
In Vitro Enzyme Inhibition
IC50
<100±n/a nM
Citation
 McDonald, AQian, S Therapeutic inhibitory compounds US Patent  US10981893 Publication Date 4/20/2021 
Target
Name:
Plasma kallikrein
Synonyms:
Fletcher factor KLKB1 Kallikrein Plasma kallikrein heavy chain Plasma prekallikrein
Type:
Protein
Mol. Mass.:
71391.16
Organism:
Homo sapiens (Human)
Description:
P03952
Residue:
638
  
Inhibitor
Name:
BDBM492899
Synonyms:
N-((6-amino-2- methylpyridin-3- yl)methyl)-2-(3- (methylsulfonyl)-4-((2- oxopyridin-1(2H)- yl)methyl)benzyl) isonicotinamide | US10981893, Example 28
Type:
Small organic molecule
Emp. Form.:
C27H27N5O4S
Mol. Mass.:
517.599
SMILES:
Cc1nc(N)ccc1CNC(=O)c1ccnc(Cc2ccc(Cn3ccccc3=O)c(c2)S(C)(=O)=O)c1
: