Target
Replicase polyprotein 1ab
Ligand
BDBM496883
Substrate
Meas. Tech.
Antiviral assay
EC50
>100000±n/a nM
Citation
 Ghosh, AKRaghavaiah, JShahabi, DYadav, MAnson, BJLendy, EKHattori, SIHigashi-Kuwata, NMitsuya, HMesecar, AD Indole Chloropyridinyl Ester-Derived SARS-CoV-2 3CLpro Inhibitors: Enzyme Inhibition, Antiviral Efficacy, Structure-Activity Relationship, and X-ray Structural Studies. J Med Chem 64:14702-14714 (2021)  
Target
Name:
Replicase polyprotein 1ab
Synonyms:
ORF1ab polyprotein pp1ab | rep
Type:
Protein
Mol. Mass.:
794070.71
Organism:
2019-nCoV
Description:
P0DTD1
Residue:
7096
  
Inhibitor
Name:
BDBM496883
Synonyms:
indole chloropyridinyl-ester derived, 7l
Type:
Small Organic Molecule
Emp. Form.:
C13H7ClN2O3
Mol. Mass.:
274.659
SMILES:
Clc1cncc(OC(=O)c2cccc3ncoc23)c1
: