Target
Fibroblast growth factor receptor 3
Ligand
BDBM443221
Substrate
Meas. Tech.
Determination of the Effect of the Compounds of the Present Invention Against FGFR Kinase Activity
IC50
179±n/a nM
Citation
 Chen, LGuan, DBai, HGou, JZhao, WWang, ZLing, LMa, Y Pyrimidine derivative, method for preparing same and use thereof in medicine US Patent  US11001572 Publication Date 5/11/2021 
Target
Name:
Fibroblast growth factor receptor 3
Synonyms:
CD_antigen: CD333 FGFR3 Fibroblast growth factor receptor JTK4
Type:
Protein
Mol. Mass.:
87699.57
Organism:
Homo sapiens (Human)
Description:
P22607
Residue:
806
  
Inhibitor
Name:
BDBM443221
Synonyms:
N-(2-((6-(3-(2,6-Dichloro-3,5-dimethoxyphenyl)-1-methylureido)pyrimidin-4-yl)amino)-5-(4,7-diazaspiro[2.5]octan-7-yl)phenyl)acrylamide US11001572, Example 2
Type:
Small organic molecule
Emp. Form.:
C29H32Cl2N8O4
Mol. Mass.:
627.522
SMILES:
COc1cc(OC)c(Cl)c(NC(=O)N(C)c2cc(Nc3ccc(cc3NC(=O)C=C)N3CCNC4(CC4)C3)ncn2)c1Cl
: