Target
Fibroblast growth factor receptor 3
Ligand
BDBM443223
Substrate
Meas. Tech.
Determination of the Effect of the Compounds of the Present Invention Against FGFR Kinase Activity
IC50
439±n/a nM
Citation
 Chen, LGuan, DBai, HGou, JZhao, WWang, ZLing, LMa, Y Pyrimidine derivative, method for preparing same and use thereof in medicine US Patent  US11001572 Publication Date 5/11/2021 
Target
Name:
Fibroblast growth factor receptor 3
Synonyms:
CD_antigen: CD333 FGFR3 Fibroblast growth factor receptor JTK4
Type:
Protein
Mol. Mass.:
87699.57
Organism:
Homo sapiens (Human)
Description:
P22607
Residue:
806
  
Inhibitor
Name:
BDBM443223
Synonyms:
N-(2-((6-(3-(2,6-Dichloro-3,5-dimethoxyphenyl)-1-methylureido)pyrimidin-4-yl)amino)-5-(7-ethyl-2,7-diazaspiro[3.5]nonan-2-yl)phenyl)acrylamide US11001572, Example 4
Type:
Small organic molecule
Emp. Form.:
C32H38Cl2N8O4
Mol. Mass.:
669.601
SMILES:
CCN1CCC2(CN(C2)c2ccc(Nc3cc(ncn3)N(C)C(=O)Nc3c(Cl)c(OC)cc(OC)c3Cl)c(NC(=O)C=C)c2)CC1
: